{"text_format":"1","workbook":"xlsx","n_sheets":10,"sheets":["Stappenplan","import Alg. uitgangspunten KSDW","import DATA-CoP KSDW ","A Scope parameters","B Nw en Renovatie parameters","C  Begrotingsblad","D Presentatie+grafieken","E Rekenblad","Bijlage Begrippen SSK","F Redundantietoeslag"],"not_rendered":{"charts":6,"images":6,"macros":1,"external_links":1,"defined_names":3,"comments":7,"pivot_tables":0},"unopened":[],"bounds":{"document_bytes":16777216,"sheet_cells":100000,"rows_first":2000,"rows_last":500,"rows_between":2000,"halvings":0,"cell_chars":16384,"cell_head_chars":4096},"cells_cut":0,"cells_raw":0,"read":"whole","date_system":"1900"}

{"sheet":"Stappenplan","index":0,"n_rows":84,"n_cols":13,"rows_kept":84,"cut":false,"hidden":false,"merged":[[5,0,5,2],[21,0,21,2],[44,0,44,2],[50,0,50,2],[60,0,60,2],[51,0,51,2],[55,0,55,2]]}
["Kostenmodel",null,"KSDW raming budget en renovaties"]
["Versiedatum",null,"7-11-2025"]
["Vragen over beheer",null,"Marcel Bakker / Babette Schep / Reinier Frölke"]
[]
["Start","#","Importeren data uit KSDW"]
["Met deze tool kunnen ramingen uit de kostenstandaard drinkwater (KSDW) worden \"doorvertaald\" naar daadwerkelijke investeringen, waar ook rekening wordt gehouden met de verhouding nieuwbouw en renovatie. De basis van deze berekening is de input vanuit de kostenstandaard webtool . Stap 1 omvat het importeren van de juiste gegevens uit de KSDW export naar het voorliggende excelbestand. We gebruiken de uitgangspunten uit tabblad Algemene uitgangspunten en de grove ramingsdata uit tabblad Data CoP KSDW.\n\nVoor het gebruik van deze raming budget en renovatietool is het van belang dat in het project in de KSDW:\n- De processen voor 100% capaciteit ingevoerd worden, ookal wordt een deel van de capaciteit gerenoveerd of met rust gelaten. Dit kan later in dit Excel sjabloon  worden verwerkt.\n- Een eventuele redundantiefactor voor het strikt scheiden van straten buiten de KSDW wordt gehouden. Het effect hiervan op de kosten kan later in dit Excel sjabloon toegevoegd worden.\n\nOp tabblad Bijlage Begrippen SSK wordt door middel van een voorbeeld uitleg gegeven over de verschillende termen binnen de SSK systematiek, deze worden ook gebruikt in deze budget- en renovatietool."]
[]
["1) Algemene uitgangspunten","1.1","Exporteer het alternatief (als Excel) vanaf de kostenstandaard webtool (www.kostenstandaard.nl), zie figuur rechts"]
[null,"1.2","Selecteer in deze Excel export uit de kostenstandaard webtool het tabblad \"Algemene uitgangspunten\""]
[null,"1.3","Ga op cel A1 staan en typ \"Ctrl+a\" en vervolgens \"Ctrl+c\" om alle gegevens te selecteren en te kopieren."]
{"$rows_left_out":75}
{"sheet":"import Alg. uitgangspunten KSDW","index":1,"n_rows":18,"n_cols":3,"rows_kept":18,"cut":false,"hidden":false,"merged":[]}
["Algemene uitgangspunten"]
[]
["Auteur:"]
["Bedrijf:"]
["Datum:"]
[]
["Project naam:"]
["Alternatief:"]
[]
["Project kengetallen"]
{"$rows_left_out":9}
{"sheet":"import DATA-CoP KSDW ","index":2,"n_rows":1,"n_cols":1,"rows_kept":1,"cut":false,"hidden":false,"merged":[]}
["PLAK HIER"]

{"sheet":"A Scope parameters","index":3,"n_rows":29,"n_cols":24,"rows_kept":29,"cut":false,"hidden":false,"merged":[]}
[1,"Bouwkosten","Default waarde","Toelichting ","Minimum","Default","Maximum"]
[null,"Sloopkosten",0,"Vul de totale sloopkosten. Let op: boekhoudkundig zijn dit GEEN investeringskosten en worden apart gehouden. Voor de volledigheid worden deze kosten hier wel meegenomen.","-","-","-",null,null,null,null,null,null,null,null,null,null,null,null,null,null,null,null,"Origineel KSDW"]
[null,"Indirecte bouwkosten discipline Civiele techniek en Bouwkunde (CTB)",0.25,"Voor het meenemen van indirecte bouwkosten bij huidige marktsituatie. Dit komt bovenop de directe bouwkosten voor deze discipline uit de KSDW-raming.",0.15,0.25,0.45,null,null,null,null,null,null,null,null,null,null,null,null,null,null,null,"c",0.2]
[null,"Indirecte bouwkosten discipline Werktuigbouwkunde (WTB)",0.3,"Voor het meenemen van indirecte bouwkosten bij huidige marktsituatie. Dit komt bovenop de directe bouwkosten voor deze discipline uit de KSDW-raming.",0.2,0.3,0.5,null,null,null,null,null,null,null,null,null,null,null,null,null,null,null,"w",0.25]
[null,"Indirecte bouwkosten discipline Elektro & Instrumentatie (E&I)",0.4,"Voor het meenemen van indirecte bouwkosten bij huidige marktsituatie. Dit komt bovenop de directe bouwkosten voor deze discipline uit de KSDW-raming.",0.25,0.4,0.6,null,null,null,null,null,null,null,null,null,null,null,null,null,null,null,"e",0.35]
[null,"Indirecte bouwkosten discipline Procesautomatisering (PA)",0.4,"Voor het meenemen van indirecte bouwkosten bij huidige marktsituatie. Dit komt bovenop de directe bouwkosten voor deze discipline uit de KSDW-raming.",0.25,0.4,0.6,null,null,null,null,null,null,null,null,null,null,null,null,null,null,null,"pa",0.35]
[]
[2,"Vastgoedkosten (grondaankoop, zakelijk recht e.d.)",0,"Bedrag in €","-","-","-"]
[]
[3,"Engineeringskosten (OG+IB)","Default waarde","Toelichting ","Minimum","Default","Maximum"]
{"$rows_left_out":20}
{"sheet":"B Nw en Renovatie parameters","index":4,"n_rows":34,"n_cols":30,"rows_kept":34,"cut":false,"hidden":false,"merged":[[3,16,4,20],[2,29,3,29],[9,29,10,29],[10,4,11,4],[10,5,11,5],[10,6,11,6],[3,9,4,9],[3,3,4,7]]}
[null,null,null,null,null,null,null,null,null,null,null,null,null,null,null,null,null,null,null,null,null,null,null,null,"Tabel 3.1 Default toeslagpercentages renovatie"]
[null,null,null,null,null,null,null,null,null,null,null,null,null,null,null,null,null,null,null,null,null,null,null,null,{"$f":"$D12","v":"CTB"},{"$f":"$E11","v":"WTB"},{"$f":"$F11","v":"E & I"},{"$f":"$G11","v":"PA"},null,"Verdere toelichting"]
[null,null,null,null,null,null,null,null,null,null,null,null,null,null,null,null,null,null,null,null,null,null,null,null,"%","%","%","%",null,"De default toeslagpercentagen kunnen gewijzigd worden n.a.v. werkzaamheden binnen project. Tabel 3.1 (links) geeft richtlijnen voor deze percentages."]
[null,null,null,"Let op! Na overschrijving vervalt de formule die nieuwbouw en renovatie aan elkaar linkt (100% - nieuwbouw % = renovatie %). Deze formule kan weer worden terug gekopieerd uit de regel daaronder of -boven.",null,null,null,null,null,"Let op! Na handmatige overschrijving van het renovatie % vervalt de formule die nieuwbouw en renovatie aan elkaar linkt (100% - nieuwbouw % = renovatie %). Deze formule kan weer worden terug gekopieerd uit de regel daaronder of -boven.",null,null,null,null,null,null,"Let op! Deze tabel geldt als rekenblad, maak hier geen aanpassingen ",null,null,null,null,null,null,"Default toeslagpercentage renovatie",0.3,0.25,0.25,0.02]
[null,null,null,null,null,null,null,null,null,null,null,null,null,null,null,null,null,null,null,null,null,null,null,"Minimum richtlijn",0.2,0.15,0.15,0.01]
[null,null,null,null,null,null,null,null,null,null,null,null,null,null,null,null,null,null,null,null,null,null,null,"Gemiddeld",0.3,0.25,0.25,0.02]
[null,null,"NIEUWBOUW",null,null,null,null,null,null,"RENOVATIE",null,null,null,null,null,null,null,null,null,null,null,null,null,"Maximum richtlijn",0.4,0.35,0.35,0.05]
[null,null,null,null,null,null,null,null,null,"Invullen wat te doen n.a.v. scope project",null,null,null,null,null,null,"Totale som deel nieuwbouw en deel renovatie"]
[null,null,"Tabel 1.  Aandeel NIEUWBOUW binnen project","Evt. Invullen scope per discipline indien gewenst",null,null,null,null,null,"Tabel 2.  Aandeel RENOVATIE  binnen project","Evt. Invullen scope per discipline indien gewenst",null,null,null,null,null,"Let op: hier geen aanpassingen maken",null,null,null,null,null,null,null,"Tabel 3.2 Toeslagpercentage renovatie per procesdeel",null,null,null,null,"Verdere toelichting"]
[null,null,null,"(bestaande situatie/scope = 100%)",null,null,null,null,null,null,{"$f":"D10","v":"(bestaande situatie/scope = 100%)"},null,null,null,null,null,null,null,null,null,null,null,null,null,null,null,null,null,null,"In tabel 3.2 (links) kunnen de  toeslagpercentagen per processtap gewijzigd worden n.a.v. werkzaamheden binnen project"]
{"$rows_left_out":25}
{"sheet":"C  Begrotingsblad","index":5,"n_rows":59,"n_cols":6,"rows_kept":59,"cut":false,"hidden":false,"merged":[]}
["RAMINGSOVERZICHT"]
["Projectnummer:",null,null,"Prijspeil:",null,{"$f":"'import Alg. uitgangspunten KSDW'!B5","v":"00:00:00"}]
["Projectomschrijving: ",null,null,"Datum:"]
["Project fase:",null,null,"Opgesteld door:"]
[null,null,null,"Versie:"]
[]
[]
[null,"NIEUWBOUW",null,"RENOVATIE",null,"TOTAAL"]
[null,"GEDEELTE",null,"GEDEELTE",null,"NW+RENOVATIE"]
[null,"KSDW+aanpassing",null,"KSDW+aanpassing",null,"KSDW+aanpassing"]
{"$rows_left_out":50}
{"sheet":"D Presentatie+grafieken","index":6,"n_rows":114,"n_cols":6,"rows_kept":114,"cut":false,"hidden":false,"merged":[[86,5,87,6]]}
[]
[]
[1,"Bouwkosten per processtap (inclusief indirecte bouwkosten, exclusief toeslagen)"]
["Totaal BK bij 100% nieuwbouw","Processtap","Deel Nieuwbouw BK","Deel Renovatie BK","Totaal (Deel nieuwbouw BK + Deel Renovatie BK)"]
[{"$f":"'E Rekenblad'!L9","v":0},{"$f":"'E Rekenblad'!B9","v":0},{"$f":"'E Rekenblad'!V9","v":0},{"$f":"'E Rekenblad'!AF9","v":0},{"$f":"'E Rekenblad'!AP9","v":0}]
[{"$f":"'E Rekenblad'!L10","v":0},{"$f":"'E Rekenblad'!B10","v":0},{"$f":"'E Rekenblad'!V10","v":0},{"$f":"'E Rekenblad'!AF10","v":0},{"$f":"'E Rekenblad'!AP10","v":0}]
[{"$f":"'E Rekenblad'!L11","v":0},{"$f":"'E Rekenblad'!B11","v":0},{"$f":"'E Rekenblad'!V11","v":0},{"$f":"'E Rekenblad'!AF11","v":0},{"$f":"'E Rekenblad'!AP11","v":0}]
[{"$f":"'E Rekenblad'!L12","v":0},{"$f":"'E Rekenblad'!B12","v":0},{"$f":"'E Rekenblad'!V12","v":0},{"$f":"'E Rekenblad'!AF12","v":0},{"$f":"'E Rekenblad'!AP12","v":0}]
[{"$f":"'E Rekenblad'!L13","v":0},{"$f":"'E Rekenblad'!B13","v":0},{"$f":"'E Rekenblad'!V13","v":0},{"$f":"'E Rekenblad'!AF13","v":0},{"$f":"'E Rekenblad'!AP13","v":0}]
[{"$f":"'E Rekenblad'!L14","v":0},{"$f":"'E Rekenblad'!B14","v":0},{"$f":"'E Rekenblad'!V14","v":0},{"$f":"'E Rekenblad'!AF14","v":0},{"$f":"'E Rekenblad'!AP14","v":0}]
{"$rows_left_out":105}
{"sheet":"E Rekenblad","index":7,"n_rows":102,"n_cols":42,"rows_kept":102,"cut":false,"hidden":false,"merged":[]}
[]
[]
[null,null,null,"NIEUWBOUW uit kostenstandaard",null,null,null,null,null,"EXPORT KSDW",null,null,null,"DEEL NIEUWBOUW ",null,null,null,null,null,"DEEL NIEUWBOUW ",null,null,null,"DEEL RENOVATIE",null,null,null,null,null,"DEEL RENOVATIE",null,null,null,"TOTAAL PROJECT",null,null,null,null,null,"TOTAAL PROJECT"]
[]
[null,null,null,null,null,null,null,null,null,null,{"$f":"K30/J30","v":{"$error":"#DIV/0!"}},null,null,null,null,null,null,null,null,null,{"$f":"U30/T30","v":{"$error":"#DIV/0!"}},null,null,null,null,null,null,null,null,null,{"$f":"AE30/AD30","v":{"$error":"#DIV/0!"}},null,null,null,null,null,null,null,null,null,{"$f":"AO30/AN30","v":{"$error":"#DIV/0!"}}]
[null,null,null,"Nieuw (bouwkosten) uit kostenstandaard",null,null,null,null,null,null,null,"Totaal  ",null,"Nieuw (bouwkosten) uit kostenstandaard",null,null,null,null,null,null,null,"Totaal  ",null,"Renovatie- (bouwkosten)(omgerekend o.b.v. KSDW)",null,null,null,null,null,null,null,"Totaal  ",null,"Totaal Bouwkosten (deel nieuw + deel renovatie)",null,null,null,null,null,null,null,"Totaal  "]
[null,null,null,"CTB","WTB","E & I","PA","Vulmaterialen","Alg. Voorzieningen","Totaal","Indirecte BK","Bouwkosten\n(nieuwbouw)",null,"CTB","WTB","E & I","PA","Vul materialen","Alg. Voorzieningen","Totaal","Indirecte BK","Bouwkosten\n(DEEL NIEUWBOUW)",null,"CTB","WTB","E & I","PA","Vul materialen","Alg. Voorzieningen","Totaal","Indirecte BK","Bouwkosten\n(DEEL RENOVATIE)",null,"CTB","WTB","E & I","PA","Vul materialen","Alg.voorz.","Totaal","Indirecte BK","Bouwkosten (TOTAAL PROJECT)"]
[null,"Processtapbenaming",null,"Directe BK",{"$f":"$D$8","v":"Directe BK"},{"$f":"$D$8","v":"Directe BK"},{"$f":"$D$8","v":"Directe BK"},"Directe BK","Directe BK","Directe BK","Indirecte BK","Totale VBK",null,"Directe BK",{"$f":"$D$8","v":"Directe BK"},{"$f":"$D$8","v":"Directe BK"},{"$f":"$D$8","v":"Directe BK"},"Directe BK","Directe BK","Directe BK","Indirecte BK","Totale VBK",null,{"$f":"$D$8","v":"Directe BK"},{"$f":"$D$8","v":"Directe BK"},"Directe BK","Directe BK","Directe BK","Directe BK","Directe BK",{"$f":"K8","v":"Indirecte BK"},{"$f":"D8","v":"Directe BK"},null,{"$f":"$D$8","v":"Directe BK"},{"$f":"$D$8","v":"Directe BK"},"Directe BK","Directe BK","Directe BK","Directe BK","Directe BK",{"$f":"U8","v":"Indirecte BK"},{"$f":"N8","v":"Directe BK"}]
[{"$f":"IF(B9=\"Infra\",27,'import DATA-CoP KSDW '!D6)","v":0},{"$f":"'import DATA-CoP KSDW '!E6","v":0},null,{"$f":"('import DATA-CoP KSDW '!$O6)/(1+'A Scope parameters'!X$3)","v":0},{"$f":"'import DATA-CoP KSDW '!Q6/(1+'A Scope parameters'!X$4)","v":0},{"$f":"'import DATA-CoP KSDW '!S6/(1+'A Scope parameters'!X$5)","v":0},{"$f":"'import DATA-CoP KSDW '!U6/(1+'A Scope parameters'!X$6)","v":0},{"$f":"'import DATA-CoP KSDW '!V6/(1+'A Scope parameters'!X$3)","v":0},{"$f":"IF(A9=27,0,(SUM(D9:G9)+H9)*(('import DATA-CoP KSDW '!W$5+'import DATA-CoP KSDW '!X$5+'import DATA-CoP KSDW '!Y$5)/100))","v":0},{"$f":"SUM(D9:I9)","v":0},{"$f":"'A Scope parameters'!C$3*D9+'A Scope parameters'!C$4*E9+'A Scope parameters'!C$5*F9+'A Scope parameters'!C$6*G9+'A Scope parameters'!C$3*(H9+I9)","v":0},{"$f":"J9+K9","v":0},null,{"$f":"D9*'B Nw en Renovatie parameters'!D14","v":0},{"$f":"E9*'B Nw en Renovatie parameters'!E14","v":0},{"$f":"F9*'B Nw en Renovatie parameters'!F14","v":0},{"$f":"G9*'B Nw en Renovatie parameters'!G14","v":0},{"$f":"H9*'B Nw en Renovatie parameters'!H14","v":0},{"$f":"IF(A9=27,0,IF(A9=0,0,I9*SUM(N9:R9)/SUM(D9:H9)))","v":0},{"$f":"SUM(N9:S9)","v":0},{"$f":"'A Scope parameters'!C$3*N9+'A Scope parameters'!C$4*O9+'A Scope parameters'!C$5*P9+'A Scope parameters'!C$6*Q9+'A Scope parameters'!C$3*(R9+S9)","v":0},{"$f":"T9+U9","v":0},null,{"$f":"D9*'B Nw en Renovatie parameters'!K14*(1+'B Nw en Renovatie parameters'!Y14)","v":0},{"$f":"E9*'B Nw en Renovatie parameters'!L14*(1+'B Nw en Renovatie parameters'!Z14)","v":0},{"$f":"F9*'B Nw en Renovatie parameters'!M14*(1+'B Nw en Renovatie parameters'!AA14)","v":0},{"$f":"G9*'B Nw en Renovatie parameters'!N14*(1+'B Nw en Renovatie parameters'!AB14)","v":0},{"$f":"H9*'B Nw en Renovatie parameters'!O14","v":0},{"$f":"IF(A9=27,0,IF(A9=0,0,I9*SUM(X9:AB9)/SUM(D9:H9)))","v":0},{"$f":"SUM(X9:AC9)","v":0},{"$f":"'A Scope parameters'!C$3*X9+'A Scope parameters'!C$4*Y9+'A Scope parameters'!C$5*Z9+'A Scope parameters'!C$6*AA9+'A Scope parameters'!C$3*(AB9+AC9)","v":0},{"$f":"AD9+AE9","v":0},null,{"$f":"N9+X9","v":0},{"$f":"O9+Y9","v":0},{"$f":"P9+Z9","v":0},{"$f":"Q9+AA9","v":0},{"$f":"R9+AB9","v":0},{"$f":"S9+AC9","v":0},{"$f":"T9+AD9","v":0},{"$f":"U9+AE9","v":0},{"$f":"V9+AF9","v":0}]
[{"$f":"IF(B10=\"Infra\",27,'import DATA-CoP KSDW '!D7)","v":0},{"$f":"'import DATA-CoP KSDW '!E7","v":0},null,{"$f":"('import DATA-CoP KSDW '!$O7)/(1+'A Scope parameters'!X$3)","v":0},{"$f":"'import DATA-CoP KSDW '!Q7/(1+'A Scope parameters'!X$4)","v":0},{"$f":"'import DATA-CoP KSDW '!S7/(1+'A Scope parameters'!X$5)","v":0},{"$f":"'import DATA-CoP KSDW '!U7/(1+'A Scope parameters'!X$6)","v":0},{"$f":"'import DATA-CoP KSDW '!V7/(1+'A Scope parameters'!X$3)","v":0},{"$f":"IF(A10=27,0,(SUM(D10:G10)+H10)*(('import DATA-CoP KSDW '!W$5+'import DATA-CoP KSDW '!X$5+'import DATA-CoP KSDW '!Y$5)/100))","v":0},0,{"$f":"'A Scope parameters'!C$3*D10+'A Scope parameters'!C$4*E10+'A Scope parameters'!C$5*F10+'A Scope parameters'!C$6*G10+'A Scope parameters'!C$3*(H10+I10)","v":0},0,null,{"$f":"D10*'B Nw en Renovatie parameters'!D15","v":0},{"$f":"E10*'B Nw en Renovatie parameters'!E15","v":0},{"$f":"F10*'B Nw en Renovatie parameters'!F15","v":0},{"$f":"G10*'B Nw en Renovatie parameters'!G15","v":0},{"$f":"H10*'B Nw en Renovatie parameters'!H15","v":0},0,0,{"$f":"'A Scope parameters'!C$3*N10+'A Scope parameters'!C$4*O10+'A Scope parameters'!C$5*P10+'A Scope parameters'!C$6*Q10+'A Scope parameters'!C$3*(R10+S10)","v":0},0,null,{"$f":"D10*'B Nw en Renovatie parameters'!K15*(1+'B Nw en Renovatie parameters'!Y15)","v":0},{"$f":"E10*'B Nw en Renovatie parameters'!L15*(1+'B Nw en Renovatie parameters'!Z15)","v":0},{"$f":"F10*'B Nw en Renovatie parameters'!M15*(1+'B Nw en Renovatie parameters'!AA15)","v":0},{"$f":"G10*'B Nw en Renovatie parameters'!N15*(1+'B Nw en Renovatie parameters'!AB15)","v":0},{"$f":"H10*'B Nw en Renovatie parameters'!O15","v":0},0,{"$f":"SUM(X10:AC10)","v":0},{"$f":"'A Scope parameters'!C$3*X10+'A Scope parameters'!C$4*Y10+'A Scope parameters'!C$5*Z10+'A Scope parameters'!C$6*AA10+'A Scope parameters'!C$3*(AB10+AC10)","v":0},{"$f":"AD10+AE10","v":0},null,0,0,0,0,0,0,0,0,0]
{"$rows_left_out":93}
{"sheet":"Bijlage Begrippen SSK","index":8,"n_rows":83,"n_cols":10,"rows_kept":83,"cut":false,"hidden":false,"merged":[]}
["SSK Methodiek in a nutshell"]
["Voorbeeld  ","Kostenopbouw nieuwbouw van een garage"]
["Van: ","Marcel Bakker RHDHV"]
["Datum: ","2025-04-09"]
[]
["ALGEMEEN:","Hieronder de onderverdeling van de kosten op een objectblad ( in dit geval per discipline maar kan bv ook geografisch)"]
[null,"In het summary blad SSK worden de totalen van deze objectbladen overzichtelijke weergegeven. "]
[null,"De kleuren in de onderstaande tabel corresponderen met de kleuren in de figuur rechts (\"SSK methodiek in a nutshell - OPBOUW BOUWKOSTEN\")"]
["1) BOUWKOSTEN"]
["A"]
{"$rows_left_out":74}
{"sheet":"F Redundantietoeslag","index":9,"n_rows":9,"n_cols":24,"rows_kept":9,"cut":false,"hidden":true,"merged":[]}
[null,null,"Uitleg redundantie factoren"]
[null,null,null,"Kosten/ straat"]
[null,null,null,"Y(mln)","=","a","*","x","^","b",null,"Kosten x",null,null,null,null,null,"Meest waarschijnlijk",null,null,null,null,"Pull down menu"]
["Machtfactor",null,null,null,null,null,null,null,null,0.7,null,"aantal straten","Verhouding",null,null,"Machtfactor",0.6,0.65,0.7,0.75,0.8,null,"Tabblad A"]
["1 van",1,"Straat",{"$f":"H5^J5","v":5.0118723362727229},"=",1,"*",10,"^",{"$f":"J$4","v":0.7},null,{"$f":"B5*D5","v":5.0118723362727229},{"$f":"L5/L$5","v":1},null,null,1,1,1,1,1,1,null,0]
["1 van",2,"Straten",{"$f":"H6^J6","v":3.0851693136000478},"=",1,"*",{"$f":"H5/B6","v":5},"^",{"$f":"J$4","v":0.7},null,{"$f":"B6*D6","v":6.1703386272000955},{"$f":"L6/L$5","v":1.2311444133449161},null,null,2,1.319507910772894,1.274560627319262,1.2,1.1892071150027206,1.1486983549970347,null,{"$f":"S6-1","v":0.19999999999999996}]
["1 van",3,"Straten",{"$f":"H7^J7","v":2.3228176731198298},"=",1,"*",{"$f":"H5/B7","v":3.3333333333333335},"^",{"$f":"J$4","v":0.7},null,{"$f":"B7*D7","v":6.9684530193594894},{"$f":"L7/L$5","v":1.3903891703159093},null,null,3,1.5509142802625859,1.467945751979395,1.3937999999999999,1.3150868340094011,1.2447342551654641,null,{"$f":"S7-1","v":0.39379999999999993}]
["1 van",4,"Straten",{"$f":"H8^J8","v":1.8991444823309347},"=",1,"*",{"$f":"H5/B8","v":2.5},"^",{"$f":"J$4","v":0.7},null,{"$f":"B8*D8","v":7.5965779293237388},{"$f":"L8/L$5","v":1.515716566510398},null,null,4,1.7411011265922482,1.6245047927124709,1.52,1.4142135623730949,1.319507910772894,null,{"$f":"S8-1","v":0.52}]
[null,null,null,null,null,null,null,null,null,null,null,null,null,null,null,null,null,null,null,null,null,null,"Keuze",1]